BDBM502643 N-{4-[7- (3,5- dimethyl- isoxazol-4- yl)-1- methyl- [1,2,4]triazolo [4,3-a] quinoxaline- 4-ylamino]- butyl}-2- (S)-hydroxy-::US11028090, Example 587
SMILES CC(C)[C@H](O)C(=O)NCCCCNc1nc2cc(ccc2n2c(C)nnc12)-c1c(C)noc1C
InChI Key InChIKey=YJRTVAGLLUZFPF-NRFANRHFSA-N
Data  1 IC50
  Tab Delimited (TSV)   2D SDfile   Computed 3D by Vconf -m prep SDfile
Find this compound or compounds like it in BindingDB:
Activity Spreadsheet -- Enzyme Inhibition Constant Data from BindingDB
Found 1 hit for monomerid = 502643
TargetBromodomain-containing protein 4(Homo sapiens (Human))
Dong Wha Pharm.
US Patent
LigandPNGBDBM502643(N-{4-[7- (3,5- dimethyl- isoxazol-4- yl)-1- methyl...)
Affinity DataIC50:  7nM. Assay description: The following experiment was performed to evaluate the ability of [1,2,4]triazolo[4,3-a]quinoxaline derivative of the present invention to inhibit th...
Ligand InfoPC cidPC sid
In DepthDetails US Patent