BDBM50264461 CHEMBL508925::N-Fmoc-Gla-Leu-(3'-NH2-Tyr)-(alpha-Me)Glu-Asn-amide
SMILES CC(C)C[C@H](NC(=O)[C@H](CC(C(O)=O)C(O)=O)NC(=O)OCC1c2ccccc2-c2ccccc12)C(=O)N[C@@H](Cc1ccc(O)c(N)c1)C(=O)N[C@@](C)(CCC(O)=O)C(=O)N[C@@H](CC(N)=O)C(N)=O
InChI Key InChIKey=NTWIIPXPRFWSTH-YZVZLXLVSA-N
Data  1 IC50
  Tab Delimited (TSV)   2D SDfile   Computed 3D by Vconf -m prep SDfile
Find this compound or compounds like it in BindingDB:
Activity Spreadsheet -- Enzyme Inhibition Constant Data from BindingDB
Found 1 hit for monomerid = 50264461
TargetGrowth factor receptor-bound protein 2(Homo sapiens (Human))
Chinese Academy Of Sciences
Curated by ChEMBL
LigandPNGBDBM50264461(CHEMBL508925 | N-Fmoc-Gla-Leu-(3'-NH2-Tyr)-(alpha-...)
Affinity DataIC50:  4.40E+3nM. Assay description: Binding affinity to recombinant Grb2 SH2 domain by surface plasmon resonance analysis
In DepthDetails ArticlePubMed