BDBM50265334 (R)-N-(1-(5-(5-chloro-3-fluoro-2-(2-methyl-2H-tetrazol-5-yl)phenyl)-3-fluoropyridin-2-yl)ethyl)-1-hydroxycyclopentanecarboxamide::CHEMBL521735
SMILES C[C@@H](NC(=O)C1(O)CCCC1)c1ncc(cc1F)-c1cc(Cl)cc(F)c1-c1nnn(C)n1
InChI Key InChIKey=JAQVGTMJPPLNDT-LLVKDONJSA-N
Data  1 KI
  Tab Delimited (TSV)   2D SDfile   Computed 3D by Vconf -m prep SDfile
Find this compound or compounds like it in BindingDB:
Activity Spreadsheet -- Enzyme Inhibition Constant Data from BindingDB
Found 1 hit for monomerid = 50265334
TargetB1 bradykinin receptor(Homo sapiens (Human))
Merck
Curated by ChEMBL
LigandPNGBDBM50265334((R)-N-(1-(5-(5-chloro-3-fluoro-2-(2-methyl-2H-tetr...)
Affinity DataKi:  0.480nM. Assay description: Displacement of [3H]des-arg10leu9kallidin from human bradykinin B1 receptor expressed in CHO cells by Wallac beta-plate scintillation counting
In DepthDetails ArticlePubMed