BDBM50265724 (2S,5S,8S,11S,14S)-8-((1H-imidazol-5-yl)methyl)-14-((5S,8S,11S,14S,17S,20S,26S,29S)-32-amino-17,29-bis(3-amino-3-oxopropyl)-5,8-di-sec-butyl-20-(3-guanidinopropyl)-14-isobutyl-26-isopropyl-11-methyl-4,7,10,13,16,19,22,25,28,31-decaoxo-3,6,9,12,15,18,21,24,27,30-decaazadotriacontanamido)-5-(2-amino-2-oxoethyl)-11-(carboxymethyl)-2-(3-guanidinopropyl)-4,7,10,13-tetraoxo-3,6,9,12-tetraazahexadecane-1,16-dioic acid::CHEMBL448869
SMILES CC[C@H](C)[C@H](NC(=O)[C@@H](NC(=O)[C@H](C)NC(=O)[C@H](CC(C)C)NC(=O)[C@H](CCC(N)=O)NC(=O)[C@H](CCCN=C(N)N)NC(=O)CNC(=O)[C@@H](NC(=O)[C@H](CCC(N)=O)NC(=O)CN)C(C)C)[C@@H](C)CC)C(=O)NCC(=O)N[C@@H](CC(O)=O)C(=O)N[C@@H](CC(O)=O)C(=O)N[C@@H](Cc1cnc[nH]1)C(=O)N[C@@H](CC(N)=O)C(=O)N[C@@H](CCCN=C(N)N)C(O)=O
InChI Key InChIKey=KYSHUZZOHOJTNA-BSQRSYIBSA-N
Data  1 EC50
  Tab Delimited (TSV)   2D SDfile   Computed 3D by Vconf -m prep SDfile
Find this compound or compounds like it in BindingDB:
Activity Spreadsheet -- Enzyme Inhibition Constant Data from BindingDB
Found 1 hit for monomerid = 50265724
TargetBcl-2-like protein 1(Homo sapiens (Human))
University Of Montpellier
Curated by ChEMBL
LigandPNGBDBM50265724((2S,5S,8S,11S,14S)-8-((1H-imidazol-5-yl)methyl)-14...)
Affinity DataEC50:  5.12E+3nM. Assay description: Binding affinity to recombinant Bcl-XL (unknown origin) expressed in Escherichia coli BL21 by fluorescence polarization assay
In DepthDetails ArticlePubMed