BDBM50265798 CHEMBL3736358
SMILES Fc1ccc(cc1)-n1ncc2C[C@@]3(CN(CCC3=Cc12)S(=O)(=O)c1cccc(c1)C(F)(F)F)C(=O)c1ccccn1
InChI Key InChIKey=AFLJTEIJRPLXFQ-NDEPHWFRSA-N
Data  4 KI  1 IC50
  Tab Delimited (TSV)   2D SDfile   Computed 3D by Vconf -m prep SDfile
Find this compound or compounds like it in BindingDB:
Activity Spreadsheet -- Enzyme Inhibition Constant Data from BindingDB
Found 5 hits for monomerid = 50265798
TargetGlucocorticoid receptor(Homo sapiens (Human))
Corcept Therapeutics
Curated by ChEMBL
LigandPNGBDBM50265798(CHEMBL3736358)
Affinity DataKi:  0.100nM. Assay description: Displacement of fluormone GS Red from human glucocorticoid receptor after 4 hrs by fluorescence polarization assay
In DepthDetails ArticlePubMed
TargetGlucocorticoid receptor(Homo sapiens (Human))
Corcept Therapeutics
Curated by ChEMBL
LigandPNGBDBM50265798(CHEMBL3736358)
Affinity DataKi:  0.100nM. Assay description: Binding affinity to human recombinant glucocorticoid receptor by fluorescence polarization assay
In DepthDetails ArticlePubMed
TargetGlucocorticoid receptor(Homo sapiens (Human))
Corcept Therapeutics
Curated by ChEMBL
LigandPNGBDBM50265798(CHEMBL3736358)
Affinity DataKi:  14nM. Assay description: Antagonist activity at glucocorticoid receptor in human HepG2 cells assessed as inhibition of dexamethasone-induced tyrosine amino transferase activi...
In DepthDetails ArticlePubMed
TargetGlucocorticoid receptor(Homo sapiens (Human))
Corcept Therapeutics
Curated by ChEMBL
LigandPNGBDBM50265798(CHEMBL3736358)
Affinity DataKi:  14nM. Assay description: Antagonist activity at glucocorticoid receptor in human HepG2 cells assessed as inhibition of glucocorticoid-induced TAT activity after 24 hrs
In DepthDetails ArticlePubMed
TargetPotassium voltage-gated channel subfamily H member 2(Homo sapiens (Human))
Corcept Therapeutics
Curated by ChEMBL
LigandPNGBDBM50265798(CHEMBL3736358)
Affinity DataIC50: >2.00E+4nM. Assay description: Inhibition of human ERG by patch clamp technique
In DepthDetails ArticlePubMed