BDBM50266693 CHEBI:5391::Glucagen Hypokit::Glucagon::Glucagon Emergency Kit::Glucagon Recombinant
SMILES CSCC[C@H](NC(=O)[C@H](CC(C)C)NC(=O)[C@H](Cc1c[nH]c2ccccc12)NC(=O)[C@H](CCC(N)=O)NC(=O)[C@@H](NC(=O)[C@H](Cc1ccccc1)NC(=O)[C@H](CC(O)=O)NC(=O)[C@H](CCC(N)=O)NC(=O)[C@H](C)NC(=O)[C@H](CCCN=C(N)N)NC(=O)[C@H](CCCN=C(N)N)NC(=O)[C@H](CO)NC(=O)[C@H](CC(O)=O)NC(=O)[C@H](CC(C)C)NC(=O)[C@H](Cc1ccc(O)cc1)NC(=O)[C@H](CCCCN)NC(=O)[C@H](CO)NC(=O)[C@H](Cc1ccc(O)cc1)NC(=O)[C@H](CC(O)=O)NC(=O)[C@H](CO)NC(=O)[C@@H](NC(=O)[C@H](Cc1ccccc1)NC(=O)[C@@H](NC(=O)CNC(=O)[C@H](CCC(N)=O)NC(=O)[C@H](CO)NC(=O)[C@@H](N)Cc1c[nH]cn1)[C@@H](C)O)[C@@H](C)O)C(C)C)C(=O)N[C@@H](CC(N)=O)C(=O)N[C@@H]([C@@H](C)O)C(O)=O
InChI Key InChIKey=MASNOZXLGMXCHN-ZLPAWPGGSA-N
Data  23 EC50
  Tab Delimited (TSV)   2D SDfile   Computed 3D by Vconf -m prep SDfile
Find this compound or compounds like it in BindingDB:
Activity Spreadsheet -- Enzyme Inhibition Constant Data from BindingDB
Found 23 hits for monomerid = 50266693
TargetGlucagon-like peptide 1 receptor(Homo sapiens (Human))
Sanofi-Aventis Deutschland
Curated by ChEMBL
LigandPNGBDBM50266693(CHEBI:5391 | Glucagen Hypokit | Glucagon | Glucago...)
Affinity DataEC50:  0.0439nM. Assay description: Agonist activity at human GLP1R expressed in HEK293 cells assessed as cAMP accumulation after 30 mins by HTRF assay
In DepthDetails ArticlePubMed
TargetGlucagon receptor(Homo sapiens (Human))
Affiliated Tumor Hospital Of Guangxi Medical University
Curated by ChEMBL
LigandPNGBDBM50266693(CHEBI:5391 | Glucagen Hypokit | Glucagon | Glucago...)
Affinity DataEC50:  0.0790nM. Assay description: Agonist activity at human GCGR expressed in HEK293 cells incubated for 30 mins and assessed as increase in cAMP accumulation measured by HTRF assay
In DepthDetails PubMed
TargetGastric inhibitory polypeptide receptor(Homo sapiens (Human))
Sanofi-Aventis Deutschland
Curated by ChEMBL
LigandPNGBDBM50266693(CHEBI:5391 | Glucagen Hypokit | Glucagon | Glucago...)
Affinity DataEC50: >1.00E+5nM. Assay description: Agonist activity at human GIP receptor expressed in HEK293 cells assessed as cAMP accumulation after 30 mins by HTRF assay
In DepthDetails ArticlePubMed
TargetGlucagon receptor(Homo sapiens (Human))
Affiliated Tumor Hospital Of Guangxi Medical University
Curated by ChEMBL
LigandPNGBDBM50266693(CHEBI:5391 | Glucagen Hypokit | Glucagon | Glucago...)
Affinity DataEC50:  0.000500nM. Assay description: Agonist activity at human glucagon receptor expressed in HEK293 cells assessed as cAMP accumulation after 30 mins by HTRF assay
In DepthDetails ArticlePubMed
TargetGlucagon-like peptide 1 receptor(Homo sapiens (Human))
Sanofi-Aventis Deutschland
Curated by ChEMBL
LigandPNGBDBM50266693(CHEBI:5391 | Glucagen Hypokit | Glucagon | Glucago...)
Affinity DataEC50:  7.70nM. Assay description: Agonist activity at full length human GLP1R expressed in HEK293 cells assessed as increase in cAMP accumulation after 20 mins by HTRF assay
In DepthDetails ArticlePubMed
TargetGlucagon receptor(Homo sapiens (Human))
Affiliated Tumor Hospital Of Guangxi Medical University
Curated by ChEMBL
LigandPNGBDBM50266693(CHEBI:5391 | Glucagen Hypokit | Glucagon | Glucago...)
Affinity DataEC50:  0.970nM. Assay description: Agonist activity at human GCGR expressed in HEK293 cells assessed as increase in cAMP accumulation after 20 mins by HTRF assay
In DepthDetails ArticlePubMed
TargetGlucagon-like peptide 1 receptor(Homo sapiens (Human))
Sanofi-Aventis Deutschland
Curated by ChEMBL
LigandPNGBDBM50266693(CHEBI:5391 | Glucagen Hypokit | Glucagon | Glucago...)
Affinity DataEC50:  3.70nM. Assay description: Agonist activity at human GLP-1 receptor expressed in HEK293 cells assessed as cAMP accumulation after 5 hrs by luciferase reporter gene assay
In DepthDetails ArticlePubMed
TargetGlucagon receptor(Homo sapiens (Human))
Affiliated Tumor Hospital Of Guangxi Medical University
Curated by ChEMBL
LigandPNGBDBM50266693(CHEBI:5391 | Glucagen Hypokit | Glucagon | Glucago...)
Affinity DataEC50:  0.000400nM. Assay description: Agonist activity at human glucagon receptor expressed in HEK293 cells assessed as cAMP accumulation after 30 mins by HTRF assay
In DepthDetails ArticlePubMed
TargetGlucagon receptor(Homo sapiens (Human))
Affiliated Tumor Hospital Of Guangxi Medical University
Curated by ChEMBL
LigandPNGBDBM50266693(CHEBI:5391 | Glucagen Hypokit | Glucagon | Glucago...)
Affinity DataEC50:  0.0600nM. Assay description: Agonist activity at human glucagon receptor expressed in HEK293 cells assessed as cAMP accumulation after 5 hrs by luciferase reporter gene assay
In DepthDetails ArticlePubMed
TargetGlucagon-like peptide 1 receptor(Mus musculus)
Sanofi-Aventis Deutschland
Curated by ChEMBL
LigandPNGBDBM50266693(CHEBI:5391 | Glucagen Hypokit | Glucagon | Glucago...)
Affinity DataEC50:  0.0440nM. Assay description: Agonist activity at mouse GLP-1 receptor expressed in HEK293 cells assessed as cAMP accumulation after 30 mins by HTRF assay
In DepthDetails ArticlePubMed
TargetGlucagon receptor(Mus musculus)
Sanofi-Aventis Deutschland
Curated by ChEMBL
LigandPNGBDBM50266693(CHEBI:5391 | Glucagen Hypokit | Glucagon | Glucago...)
Affinity DataEC50:  0.00130nM. Assay description: Agonist activity at mouse glucagon receptor expressed in HEK293 cells assessed as cAMP accumulation after 30 mins by HTRF assay
In DepthDetails ArticlePubMed
TargetGlucagon-like peptide 1 receptor(Homo sapiens (Human))
Sanofi-Aventis Deutschland
Curated by ChEMBL
LigandPNGBDBM50266693(CHEBI:5391 | Glucagen Hypokit | Glucagon | Glucago...)
Affinity DataEC50:  0.0440nM. Assay description: Agonist activity at human GLP-1 receptor expressed in HEK293 cells assessed as cAMP accumulation after 30 mins by HTRF assay
In DepthDetails ArticlePubMed
TargetGlucagon-like peptide 1 receptor(Homo sapiens (Human))
Sanofi-Aventis Deutschland
Curated by ChEMBL
LigandPNGBDBM50266693(CHEBI:5391 | Glucagen Hypokit | Glucagon | Glucago...)
Affinity DataEC50:  41nM. Assay description: Agonist activity at human GLP1 receptor expressed in CHO cells assessed as increase in cAMP level by TR-FRET assay
In DepthDetails ArticlePubMed
TargetGlucagon receptor(Mus musculus)
Sanofi-Aventis Deutschland
Curated by ChEMBL
LigandPNGBDBM50266693(CHEBI:5391 | Glucagen Hypokit | Glucagon | Glucago...)
Affinity DataEC50:  0.0200nM. Assay description: Agonist activity at mouse GCG receptor expressed in CHO cells assessed as increase in cAMP level by TR-FRET assay
In DepthDetails ArticlePubMed
TargetGlucagon receptor(Homo sapiens (Human))
Affiliated Tumor Hospital Of Guangxi Medical University
Curated by ChEMBL
LigandPNGBDBM50266693(CHEBI:5391 | Glucagen Hypokit | Glucagon | Glucago...)
Affinity DataEC50:  0.5nM. Assay description: Agonist activity at human GCG receptor expressed in CHO cells assessed as increase in cAMP level by TR-FRET assay
In DepthDetails ArticlePubMed
TargetGlucagon-like peptide 1 receptor(Mus musculus)
Sanofi-Aventis Deutschland
Curated by ChEMBL
LigandPNGBDBM50266693(CHEBI:5391 | Glucagen Hypokit | Glucagon | Glucago...)
Affinity DataEC50:  2.60nM. Assay description: Agonist activity at mouse GLP1 receptor expressed in CHO cells assessed as increase in cAMP level by TR-FRET assay
In DepthDetails ArticlePubMed
TargetGlucagon receptor(Homo sapiens (Human))
Affiliated Tumor Hospital Of Guangxi Medical University
Curated by ChEMBL
LigandPNGBDBM50266693(CHEBI:5391 | Glucagen Hypokit | Glucagon | Glucago...)
Affinity DataEC50:  0.0210nM. Assay description: Activation of glucagon receptor (unknown origin) transfected in HEK293 cells coinfected with luciferase reporter gene linked CRE element assessed as ...
In DepthDetails ArticlePubMed
TargetGlucocorticoid receptor(Homo sapiens (Human))
University Of South Florida
Curated by ChEMBL
LigandPNGBDBM50266693(CHEBI:5391 | Glucagen Hypokit | Glucagon | Glucago...)
Affinity DataEC50:  0.0300nM. Assay description: Activation of human GCCR expressed in human HEK293 cells assessed as luminescence signal incubated for 16 hrs at 37C measured by CRE-driven luciferas...
In DepthDetails ArticlePubMed
TargetGlucocorticoid receptor(Homo sapiens (Human))
University Of South Florida
Curated by ChEMBL
LigandPNGBDBM50266693(CHEBI:5391 | Glucagen Hypokit | Glucagon | Glucago...)
Affinity DataEC50:  0.0200nM. Assay description: Activation of human GCCR expressed in human CHO-K1 cell lines assessed as intracellular cAMP generation incubated for 30 mins measured by HTRF assay
In DepthDetails ArticlePubMed
TargetGlucagon receptor(Homo sapiens (Human))
Affiliated Tumor Hospital Of Guangxi Medical University
Curated by ChEMBL
LigandPNGBDBM50266693(CHEBI:5391 | Glucagen Hypokit | Glucagon | Glucago...)
Affinity DataEC50:  0.00500nM. Assay description: Agonist activity at human GCGR expressed in frozen cells assessed as increase in cAMP production measured after 1 hr by HitHunter luminescence assay
In DepthDetails PubMed
TargetGlucagon-like peptide 1 receptor(Homo sapiens (Human))
Sanofi-Aventis Deutschland
Curated by ChEMBL
LigandPNGBDBM50266693(CHEBI:5391 | Glucagen Hypokit | Glucagon | Glucago...)
Affinity DataEC50:  0.0570nM. Assay description: Agonist activity at human GLP1R expressed in frozen cells assessed as increase in cAMP production measured after 1 hr by HitHunter luminescence assay
In DepthDetails PubMed
TargetGlucagon-like peptide 1 receptor(Homo sapiens (Human))
Sanofi-Aventis Deutschland
Curated by ChEMBL
LigandPNGBDBM50266693(CHEBI:5391 | Glucagen Hypokit | Glucagon | Glucago...)
Affinity DataEC50:  3.80nM. Assay description: Agonist activity at human GLP-1R expressed in HEK293 cells incubated for 30 mins and assessed as increase in cAMP accumulation measured by HTRF assay
In DepthDetails PubMed
TargetGlucagon-like peptide 1 receptor(Macaca fascicularis)
Sanofi-Aventis Deutschland
Curated by ChEMBL
LigandPNGBDBM50266693(CHEBI:5391 | Glucagen Hypokit | Glucagon | Glucago...)
Affinity DataEC50:  0.0310nM. Assay description: Agonist activity at monkey GLP1R expressed in HEK293 cells assessed as cAMP accumulation after 30 mins by HTRF assay
In DepthDetails ArticlePubMed