BDBM50267473 4-[Hydroxy(diphenyl)methyl]-1-methyl-1-azoniabicyclo[2.2.2]-octane Bromide::CHEMBL516121
SMILES C[N+]12CCC(CC1)(CC2)C(O)(c1ccccc1)c1ccccc1
InChI Key InChIKey=ANXQLTHEITYXMU-UHFFFAOYSA-N
Data  1 IC50
  Tab Delimited (TSV)   2D SDfile   Computed 3D by Vconf -m prep SDfile
Find this compound or compounds like it in BindingDB:
Activity Spreadsheet -- Enzyme Inhibition Constant Data from BindingDB
Found 1 hit for monomerid = 50267473
TargetMuscarinic acetylcholine receptor M3(Homo sapiens (Human))
Glaxosmithkline
Curated by ChEMBL
LigandPNGBDBM50267473(4-[Hydroxy(diphenyl)methyl]-1-methyl-1-azoniabicyc...)
Affinity DataIC50:  9.35E+5nM. Assay description: Antagonist activity at human cloned muscarinic M3 receptor expressed in CHO cells assessed as inhibition of acetylcholine-induced calcium mobilizatio...
In DepthDetails ArticlePubMed