BDBM50268066 CHEMBL4071971
SMILES Cl.Cl.CN(CC(N)=O)Cc1cccc(c1)-c1cnc(nc1)N1CCC[C@H]1CO
InChI Key InChIKey=BFILLIIJBSZIRD-RMRYJAPISA-N
Data  1 IC50
  Tab Delimited (TSV)   2D SDfile   Computed 3D by Vconf -m prep SDfile
Find this compound or compounds like it in BindingDB:
Activity Spreadsheet -- Enzyme Inhibition Constant Data from BindingDB
Found 1 hit for monomerid = 50268066
TargetMembrane primary amine oxidase(Homo sapiens (Human))
Astellas Pharma
Curated by ChEMBL
LigandPNGBDBM50268066(CHEMBL4071971)
Affinity DataIC50:  240nM. Assay description: Inhibition of human VAP-1 expressed in CHO cells using 14C-benzylamine as substrate preincubated for 20 mins followed by substrate addition measured ...
In DepthDetails ArticlePubMed