BDBM50268209 8-(4-(4-(4-Methoxybenzyl)piperazine-1-sulfonyl)phenyl)-1-propyl-3,7-dihydropurine-2,6-dione::CHEMBL482855
SMILES CCCn1c(=O)[nH]c2nc([nH]c2c1=O)-c1ccc(cc1)S(=O)(=O)N1CCN(Cc2ccc(OC)cc2)CC1
InChI Key InChIKey=JRKZOGRRHIRUCN-UHFFFAOYSA-N
Data  6 KI  1 IC50
  Tab Delimited (TSV)   2D SDfile   Computed 3D by Vconf -m prep SDfile
Find this compound or compounds like it in BindingDB:
Activity Spreadsheet -- Enzyme Inhibition Constant Data from BindingDB
Found 7 hits for monomerid = 50268209
TargetAdenosine receptor A2b(Homo sapiens (Human))
Institute
Curated by ChEMBL
LigandPNGBDBM50268209(8-(4-(4-(4-Methoxybenzyl)piperazine-1-sulfonyl)phe...)
Affinity DataKi:  0.944nM. Assay description: Displacement of [3H]PSB-603 from human recombinant adenosine A2B receptor expressed in CHO cells
In DepthDetails ArticlePubMed
TargetAdenosine receptor A1(Rattus norvegicus (rat))
Institute
Curated by ChEMBL
LigandPNGBDBM50268209(8-(4-(4-(4-Methoxybenzyl)piperazine-1-sulfonyl)phe...)
Affinity DataKi:  83.8nM. Assay description: Displacement of [3H]CCPA from rat brain cortex adenosine A1 receptor
In DepthDetails ArticlePubMed
TargetAdenosine receptor A2a(Homo sapiens (Human))
Institute
Curated by ChEMBL
LigandPNGBDBM50268209(8-(4-(4-(4-Methoxybenzyl)piperazine-1-sulfonyl)phe...)
Affinity DataKi:  328nM. Assay description: Displacement of [3H]MSX-2 from human recombinant adenosine A2A receptor expressed in CHO cells
In DepthDetails ArticlePubMed
TargetAdenosine receptor A2a(Rattus norvegicus (rat))
Institute
Curated by ChEMBL
LigandPNGBDBM50268209(8-(4-(4-(4-Methoxybenzyl)piperazine-1-sulfonyl)phe...)
Affinity DataKi:  1.02E+3nM. Assay description: Displacement of [3H]MSX-2 from rat brain striatum adenosine A2A receptor
In DepthDetails ArticlePubMed
TargetAdenosine receptor A3(Homo sapiens (Human))
Institute
Curated by ChEMBL
LigandPNGBDBM50268209(8-(4-(4-(4-Methoxybenzyl)piperazine-1-sulfonyl)phe...)
Affinity DataKi: >1.00E+4nM. Assay description: Displacement of [3H]PSB-11 from human recombinant adenosine A3 receptor expressed in CHO cells
In DepthDetails ArticlePubMed
TargetAdenosine receptor A1(Homo sapiens (Human))
Institute
Curated by ChEMBL
LigandPNGBDBM50268209(8-(4-(4-(4-Methoxybenzyl)piperazine-1-sulfonyl)phe...)
Affinity DataKi: >1.00E+4nM. Assay description: Displacement of [3H]CCPA from human adenosine A1 receptor expressed in CHO cells
In DepthDetails ArticlePubMed
TargetAdenosine receptor A2b(Homo sapiens (Human))
Institute
Curated by ChEMBL
LigandPNGBDBM50268209(8-(4-(4-(4-Methoxybenzyl)piperazine-1-sulfonyl)phe...)
Affinity DataIC50:  16.2nM. Assay description: Antagonist activity at adenosine A2B receptor in human Jurkat T cells assessed as inhibition of NECA-induced increase in intracellular calcium concen...
In DepthDetails ArticlePubMed