BDBM50268210 8-(4-(4-Benzo[1,3]dioxol-5-ylmethylpiperazine-1-sulfonyl)phenyl)-1-ethyl-3,7-dihydropurine-2,6-dione::CHEMBL483065
SMILES CCn1c(=O)[nH]c2nc([nH]c2c1=O)-c1ccc(cc1)S(=O)(=O)N1CCN(Cc2ccc3OCOc3c2)CC1
InChI Key InChIKey=ODKIIRGGBWEQPE-UHFFFAOYSA-N
Data  6 KI  1 IC50
  Tab Delimited (TSV)   2D SDfile   Computed 3D by Vconf -m prep SDfile
Find this compound or compounds like it in BindingDB:
Activity Spreadsheet -- Enzyme Inhibition Constant Data from BindingDB
Found 7 hits for monomerid = 50268210
TargetAdenosine receptor A2b(Homo sapiens (Human))
Institute
Curated by ChEMBL
LigandPNGBDBM50268210(8-(4-(4-Benzo[1,3]dioxol-5-ylmethylpiperazine-1-su...)
Affinity DataKi:  0.875nM. Assay description: Displacement of [3H]PSB-603 from human recombinant adenosine A2B receptor expressed in CHO cells
In DepthDetails ArticlePubMed
TargetAdenosine receptor A2a(Homo sapiens (Human))
Institute
Curated by ChEMBL
LigandPNGBDBM50268210(8-(4-(4-Benzo[1,3]dioxol-5-ylmethylpiperazine-1-su...)
Affinity DataKi:  102nM. Assay description: Displacement of [3H]MSX-2 from human recombinant adenosine A2A receptor expressed in CHO cells
In DepthDetails ArticlePubMed
TargetAdenosine receptor A1(Rattus norvegicus (rat))
Institute
Curated by ChEMBL
LigandPNGBDBM50268210(8-(4-(4-Benzo[1,3]dioxol-5-ylmethylpiperazine-1-su...)
Affinity DataKi:  272nM. Assay description: Displacement of [3H]CCPA from rat brain cortex adenosine A1 receptor
In DepthDetails ArticlePubMed
TargetAdenosine receptor A2a(Rattus norvegicus (rat))
Institute
Curated by ChEMBL
LigandPNGBDBM50268210(8-(4-(4-Benzo[1,3]dioxol-5-ylmethylpiperazine-1-su...)
Affinity DataKi:  436nM. Assay description: Displacement of [3H]MSX-2 from rat brain striatum adenosine A2A receptor
In DepthDetails ArticlePubMed
TargetAdenosine receptor A1(Homo sapiens (Human))
Institute
Curated by ChEMBL
LigandPNGBDBM50268210(8-(4-(4-Benzo[1,3]dioxol-5-ylmethylpiperazine-1-su...)
Affinity DataKi: >1.00E+4nM. Assay description: Displacement of [3H]CCPA from human adenosine A1 receptor expressed in CHO cells
In DepthDetails ArticlePubMed
TargetAdenosine receptor A3(Homo sapiens (Human))
Institute
Curated by ChEMBL
LigandPNGBDBM50268210(8-(4-(4-Benzo[1,3]dioxol-5-ylmethylpiperazine-1-su...)
Affinity DataKi: >1.00E+4nM. Assay description: Displacement of [3H]PSB-11 from human recombinant adenosine A3 receptor expressed in CHO cells
In DepthDetails ArticlePubMed
TargetAdenosine receptor A2b(Homo sapiens (Human))
Institute
Curated by ChEMBL
LigandPNGBDBM50268210(8-(4-(4-Benzo[1,3]dioxol-5-ylmethylpiperazine-1-su...)
Affinity DataIC50:  5.34nM. Assay description: Antagonist activity at adenosine A2B receptor in human Jurkat T cells assessed as inhibition of NECA-induced increase in intracellular calcium concen...
In DepthDetails ArticlePubMed