BDBM50269815 25-hydroxy-13(24),15,17-cheilanthatrien-19,25-olide::CHEMBL478798
SMILES CC1(C)CCC[C@@]2(C)[C@H]1CC[C@]1(C)[C@@H]2CCC(=C)[C@H]1\C=C\C1=CC(=O)OC1O
InChI Key InChIKey=YFUNKUDHWJXNSX-GSDHUERBSA-N
Data  2 IC50
  Tab Delimited (TSV)   2D SDfile   Computed 3D by Vconf -m prep SDfile
Find this compound or compounds like it in BindingDB:
Activity Spreadsheet -- Enzyme Inhibition Constant Data from BindingDB
Found 2 hits for monomerid = 50269815
TargetMAP kinase-activated protein kinase 2(Homo sapiens (Human))
Astrazeneca R&D Griffith University
Curated by ChEMBL
LigandPNGBDBM50269815(25-hydroxy-13(24),15,17-cheilanthatrien-19,25-olid...)
Affinity DataIC50:  9.00E+4nM. Assay description: Inhibition of MAPKAPK2 (unknown origin) assessed as [33P] incorporation by scintillation proximity assay
In DepthDetails ArticlePubMed
TargetRibosomal protein S6 kinase alpha-5(Homo sapiens (Human))
Astrazeneca R&D Griffith University
Curated by ChEMBL
LigandPNGBDBM50269815(25-hydroxy-13(24),15,17-cheilanthatrien-19,25-olid...)
Affinity DataIC50:  4.00E+3nM. Assay description: Inhibition of MSK1 (unknown origin) assessed as [33P] incorporation by scintillation proximity assay
In DepthDetails ArticlePubMed