BDBM50269850 CHEMBL4061600
SMILES CC(=O)N1CCc2c(C1)c(nn2[C@H]1CCOC1)N1CCCc2cc(-c3cnn(C)c3)c(cc12)C(F)F
InChI Key InChIKey=FLTYKXCCCAPRLV-IBGZPJMESA-N
Data  3 IC50
PDB links: 1 PDB ID matches this monomer.
  Tab Delimited (TSV)   2D SDfile   Computed 3D by Vconf -m prep SDfile
Find this compound or compounds like it in BindingDB:
Activity Spreadsheet -- Enzyme Inhibition Constant Data from BindingDB
Found 3 hits for monomerid = 50269850
TargetCREB-binding protein(Homo sapiens (Human))
Genentech
Curated by ChEMBL
LigandPNGBDBM50269850(CHEMBL4061600)
Affinity DataIC50:  37nM. Assay description: Inhibition of Halo-tagged histone H3.3 binding to NanoLuc luciferase conjugated human CBP expressed in HEK293 cells after overnight incubation by BRE...
TargetCREB-binding protein(Homo sapiens (Human))
Genentech
Curated by ChEMBL
LigandPNGBDBM50269850(CHEMBL4061600)
Affinity DataIC50:  1.40nM. Assay description: Displacement of biotinylated histone H3K14 peptide ligand from human recombinant His-tagged CBP measured after 10 mins by TR-FRET assay
TargetBromodomain-containing protein 4(Homo sapiens (Human))
Genentech
Curated by ChEMBL
LigandPNGBDBM50269850(CHEMBL4061600)
Affinity DataIC50:  5.60E+3nM. Assay description: Displacement of biotinylated histone H3K14 peptide ligand from human recombinant His-tagged BRD4 bromodomain-1 measured after 10 mins by TR-FRET assa...
In DepthDetails ArticlePubMed