BDBM50271485 2-(4-Bromo-3,6,7,8-tetrahydro-2H-furo[2,3-g]chromen-9-yl)ethanamine::CHEMBL482703
SMILES NCCc1c2OCCc2c(Br)c2OCCCc12
InChI Key InChIKey=VOQWACFRDPJQQY-UHFFFAOYSA-N
Data  1 KI  1 EC50
  Tab Delimited (TSV)   2D SDfile   Computed 3D by Vconf -m prep SDfile
Find this compound or compounds like it in BindingDB:
Activity Spreadsheet -- Enzyme Inhibition Constant Data from BindingDB
Found 2 hits for monomerid = 50271485
Target5-hydroxytryptamine receptor 2A(Rattus norvegicus (rat))
University Of Wisconsin-La Crosse
Curated by ChEMBL
LigandPNGBDBM50271485(2-(4-Bromo-3,6,7,8-tetrahydro-2H-furo[2,3-g]chrome...)
Affinity DataKi:  11nM. Assay description: Displacement of [3H]ketanserin from rat 5HT2A receptor expressed in mouse NIH3T3 cells
In DepthDetails ArticlePubMed
Target5-hydroxytryptamine receptor 2A(Rattus norvegicus (rat))
University Of Wisconsin-La Crosse
Curated by ChEMBL
LigandPNGBDBM50271485(2-(4-Bromo-3,6,7,8-tetrahydro-2H-furo[2,3-g]chrome...)
Affinity DataEC50:  9.40nM. Assay description: Agonist activity at rat 5HT2A receptor expressed in mouse NIH3T3 cells assessed as stimulation of inositol phosphate accumulation
In DepthDetails ArticlePubMed