BDBM50271517 1,4-bis{[(1,2,3,4-Tetrahydroacridin-9-yl)amino]ethyl}benzene::CHEMBL490660
SMILES C(Cc1ccc(CCNc2c3CCCCc3nc3ccccc23)cc1)Nc1c2CCCCc2nc2ccccc12
InChI Key InChIKey=DKBNUKQRQVQZQY-UHFFFAOYSA-N
Data  2 KI
  Tab Delimited (TSV)   2D SDfile   Computed 3D by Vconf -m prep SDfile
Find this compound or compounds like it in BindingDB:
Activity Spreadsheet -- Enzyme Inhibition Constant Data from BindingDB
Found 2 hits for monomerid = 50271517
TargetAcetylcholinesterase(Homo sapiens (Human))
Universit£
Curated by ChEMBL
LigandPNGBDBM50271517(1,4-bis{[(1,2,3,4-Tetrahydroacridin-9-yl)amino]eth...)
Affinity DataKi:  1.63nM. Assay description: Inhibition of human recombinant AChE
In DepthDetails ArticlePubMed
TargetCholinesterase(Homo sapiens (Human))
Universit£
Curated by ChEMBL
LigandPNGBDBM50271517(1,4-bis{[(1,2,3,4-Tetrahydroacridin-9-yl)amino]eth...)
Affinity DataKi:  13.9nM. Assay description: Inhibition of human recombinant BuChE
In DepthDetails ArticlePubMed