BDBM50271629 CHEMBL451950::N-((1S,2S)-1-((S)-1-benzyl-5-oxoimidazolidin-4-yl)-3-(3,5-difluorophenyl)-1-hydroxypropan-2-yl)-3-((R)-2-(methoxymethyl)pyrrolidine-1-carbonyl)-5-methylbenzamide
SMILES COC[C@H]1CCCN1C(=O)c1cc(C)cc(c1)C(=O)N[C@@H](Cc1cc(F)cc(F)c1)[C@H](O)[C@@H]1NCN(Cc2ccccc2)C1=O
InChI Key InChIKey=AZIDRLBRXVEARS-BHSUFKTOSA-N
Data  2 IC50
  Tab Delimited (TSV)   2D SDfile   Computed 3D by Vconf -m prep SDfile
Find this compound or compounds like it in BindingDB:
Activity Spreadsheet -- Enzyme Inhibition Constant Data from BindingDB
Found 2 hits for monomerid = 50271629
TargetBeta-secretase 1(Homo sapiens (Human))
Schering-Plough Research Institute
Curated by ChEMBL
LigandPNGBDBM50271629(CHEMBL451950 | N-((1S,2S)-1-((S)-1-benzyl-5-oxoimi...)
Affinity DataIC50:  2nM. Assay description: Inhibition of BACE1 (unknown origin)
In DepthDetails ArticlePubMed
TargetBeta-secretase 1(Homo sapiens (Human))
Schering-Plough Research Institute
Curated by ChEMBL
LigandPNGBDBM50271629(CHEMBL451950 | N-((1S,2S)-1-((S)-1-benzyl-5-oxoimi...)
Affinity DataIC50:  700nM. Assay description: Inhibition of BACE1 in HEK293 cells transfected with human APP cDNA containing Swedish ad London FAD mutant assessed as inhibition of amyloid beta 1-...
In DepthDetails ArticlePubMed