BDBM50271871 (3R,6R)-7-(2-Bicyclo[2.2.1]hept-2-yl-ethyl)-3-cyclohexyl-6-(4-methoxy-benzyl)-2,5,6,7-tetrahydro-3H-imidazo[1,2-a]imidazol-1-ium
SMILES COc1ccc(C[C@@H]2CN3[C@@H](C[NH+]=C3N2CCC2CC3CCC2C3)C2CCCCC2)cc1
InChI Key InChIKey=UAHVQADOWQFABV-QKBMOGKTSA-O
Data  2 IC50
  Tab Delimited (TSV)   2D SDfile   Computed 3D by Vconf -m prep SDfile
Find this compound or compounds like it in BindingDB:
Activity Spreadsheet -- Enzyme Inhibition Constant Data from BindingDB
Found 2 hits for monomerid = 50271871
TargetKappa-type opioid receptor(Cavia porcellus (domestic guinea pig))
Torrey Pines Institute For Molecular Studies
Curated by ChEMBL
LigandPNGBDBM50271871((3R,6R)-7-(2-Bicyclo[2.2.1]hept-2-yl-ethyl)-3-cycl...)
Affinity DataIC50:  276nM. Assay description: Displacement of [3H]U69593 from kappa opioid receptor in guinea pig brain homogenate
In DepthDetails ArticlePubMed
TargetKappa-type opioid receptor(Homo sapiens (Human))
Torrey Pines Institute For Molecular Studies
Curated by ChEMBL
LigandPNGBDBM50271871((3R,6R)-7-(2-Bicyclo[2.2.1]hept-2-yl-ethyl)-3-cycl...)
Affinity DataIC50:  276nM. Assay description: Inhibitory activity for kappa opioid receptor
In DepthDetails ArticlePubMed