BDBM50273745 (R)-N-[(1S,2R)-2-Hydroxyindan-1-yl]-3-[(2S,3S)-3-(2,6-dimethyl-4-dimethylamino-phenoxyacetyl)amino-2-hydroxy-4-phenylbutanoyl]-5,5-dimethyl-1,3-thiazolidine-4-carboxamide::CHEMBL504596::KNI-10282
SMILES CN(C)c1cc(C)c(OCC(=O)N[C@@H](Cc2ccccc2)[C@H](O)C(=O)N2CSC(C)(C)[C@H]2C(=O)N[C@@H]2[C@H](O)Cc3ccccc23)c(C)c1
InChI Key InChIKey=MHHYVTRSEKCASG-ZYOXRPPDSA-N
Data  1 KI
  Tab Delimited (TSV)   2D SDfile   Computed 3D by Vconf -m prep SDfile
Find this compound or compounds like it in BindingDB:
Activity Spreadsheet -- Enzyme Inhibition Constant Data from BindingDB
Found 1 hit for monomerid = 50273745
TargetPlasmepsin II(Plasmodium falciparum)
Kyoto Pharmaceutical University
Curated by ChEMBL
LigandPNGBDBM50273745((R)-N-[(1S,2R)-2-Hydroxyindan-1-yl]-3-[(2S,3S)-3-(...)
Affinity DataKi:  21nM. Assay description: Inhibition of Plasmodium falciparum plasmepsin 2
In DepthDetails ArticlePubMed