BDBM50273781 6-(5-methoxypyridin-3-yl)-1-methyl-3,4-dihydroquinolin-2(1H)-one::CHEMBL457856
SMILES COc1cncc(c1)-c1ccc2N(C)C(=O)CCc2c1
InChI Key InChIKey=HVELTVXSVCFFQC-UHFFFAOYSA-N
Data  3 IC50
  Tab Delimited (TSV)   2D SDfile   Computed 3D by Vconf -m prep SDfile
Find this compound or compounds like it in BindingDB:
Activity Spreadsheet -- Enzyme Inhibition Constant Data from BindingDB
Found 3 hits for monomerid = 50273781
TargetCytochrome P450 1A2(Homo sapiens (Human))
Saarland University
Curated by ChEMBL
LigandPNGBDBM50273781(6-(5-methoxypyridin-3-yl)-1-methyl-3,4-dihydroquin...)
Affinity DataIC50:  1.65E+4nM. Assay description: Inhibition of human recombinant CYP1A2 expressed in baculovirus-infected insect microsomes
In DepthDetails ArticlePubMed
TargetCytochrome P450 11B1, mitochondrial(Homo sapiens (Human))
Saarland University
Curated by ChEMBL
LigandPNGBDBM50273781(6-(5-methoxypyridin-3-yl)-1-methyl-3,4-dihydroquin...)
Affinity DataIC50:  87nM. Assay description: Inhibition of human CYP11B1 expressed in hamster V79 MZh cells
In DepthDetails ArticlePubMed
TargetCytochrome P450 11B2, mitochondrial(Homo sapiens (Human))
Saarland University
Curated by ChEMBL
LigandPNGBDBM50273781(6-(5-methoxypyridin-3-yl)-1-methyl-3,4-dihydroquin...)
Affinity DataIC50:  0.200nM. Assay description: Inhibition of human CYP11B2 expressed in hamster V79 MZh cells
In DepthDetails ArticlePubMed