BDBM50274063 1-(4'-Methylsulfanyl-biphenyl-3-yl)-4-oxo-1,4-dihydro-[1,8]naphthyridine-3-carboxylic acid isopropylamide::CHEMBL485547
SMILES CSc1ccc(cc1)-c1cccc(c1)-n1cc(C(=O)NC(C)C)c(=O)c2cccnc12
InChI Key InChIKey=PSUSMJVQHFLIDF-UHFFFAOYSA-N
Data  2 IC50
  Tab Delimited (TSV)   2D SDfile   Computed 3D by Vconf -m prep SDfile
Find this compound or compounds like it in BindingDB:
Activity Spreadsheet -- Enzyme Inhibition Constant Data from BindingDB
Found 2 hits for monomerid = 50274063
TargetPotassium voltage-gated channel subfamily H member 2(Homo sapiens (Human))
Merck Frosst Center For Therapeutic Research
Curated by ChEMBL
LigandPNGBDBM50274063(1-(4'-Methylsulfanyl-biphenyl-3-yl)-4-oxo-1,4-dihy...)
Affinity DataIC50:  960nM. Assay description: Displacement of [35S]MK-499 from human ERG expressed in HEK293 cells
In DepthDetails ArticlePubMed
TargetcAMP-specific 3',5'-cyclic phosphodiesterase 4A(Homo sapiens (Human))
Merck Frosst Center For Therapeutic Research
Curated by ChEMBL
LigandPNGBDBM50274063(1-(4'-Methylsulfanyl-biphenyl-3-yl)-4-oxo-1,4-dihy...)
Affinity DataIC50:  0.75nM. Assay description: Intrinsic inhibition of GST-fused human PDE4A expressed in SF9 cells
In DepthDetails ArticlePubMed