BDBM50274710 CHEMBL4127226
SMILES Cc1cc(O)cc(C)c1C[C@H](N)C(=O)N[C@H](CCCNC(N)=N)C(=O)N[C@@H](Cc1cccc(c1)-c1ccccc1)C(=O)NCC(N)=O
InChI Key InChIKey=ZEAVNFWJYMLTDA-NHKHRBQYSA-N
Data  3 IC50
  Tab Delimited (TSV)   2D SDfile   Computed 3D by Vconf -m prep SDfile
Find this compound or compounds like it in BindingDB:
Activity Spreadsheet -- Enzyme Inhibition Constant Data from BindingDB
Found 3 hits for monomerid = 50274710
TargetMu-type opioid receptor(MOUSE)
Vrije Universiteit Brussel
Curated by ChEMBL
LigandPNGBDBM50274710(CHEMBL4127226)
Affinity DataIC50:  0.850nM. Assay description: Displacement of [125I]-DAMGO from mouse Flag-tagged mu-opioid receptor expressed in HEK293 cell membranes after 60 mins by gamma counting
In DepthDetails ArticlePubMed
TargetDelta-type opioid receptor(MOUSE)
Vrije Universiteit Brussel
Curated by ChEMBL
LigandPNGBDBM50274710(CHEMBL4127226)
Affinity DataIC50:  269nM. Assay description: Tested for thromboxane antagonist potency (pA2) against U 44619 induced platelet aggregation using human platelet rich plasma
In DepthDetails ArticlePubMed
TargetMu-type opioid receptor(GUINEA PIG)
Vrije Universiteit Brussel
Curated by ChEMBL
LigandPNGBDBM50274710(CHEMBL4127226)
Affinity DataIC50:  62nM. Assay description: Agonist activity at mu-opioid receptor in guinea pig ileum assessed as inhibition of electrically induced contractions
In DepthDetails ArticlePubMed