BDBM50274835 CHEMBL511857::trans-1-(4-(3-methoxyphenyl)cyclohexyl)-4-(pyridin-2-yl)piperazine
SMILES COc1cccc(c1)[C@H]1CC[C@@H](CC1)N1CCN(CC1)c1ccccn1
InChI Key InChIKey=SHEZXZSIBXLQMP-KESTWPANSA-N
Data  3 KI  2 EC50
  Tab Delimited (TSV)   2D SDfile   Computed 3D by Vconf -m prep SDfile
Find this compound or compounds like it in BindingDB:
Activity Spreadsheet -- Enzyme Inhibition Constant Data from BindingDB
Found 5 hits for monomerid = 50274835
Target5-hydroxytryptamine receptor 1A(Homo sapiens (Human))
Karolinska Institute And Karolinska University Hospital
Curated by ChEMBL
LigandPNGBDBM50274835(CHEMBL511857 | trans-1-(4-(3-methoxyphenyl)cyclohe...)
Affinity DataKi:  0.0280nM. Assay description: Agonist activity at human 5-HT1A receptor expressed in human HeLa cell membranes assessed as stimulation of [35S]GTPgammaS binding after 20 mins by l...
In DepthDetails ArticlePubMed
Target3-beta-hydroxysteroid-Delta(8),Delta(7)-isomerase(Cavia porcellus)
Universita Degli Studi Di Bari
Curated by ChEMBL
LigandPNGBDBM50274835(CHEMBL511857 | trans-1-(4-(3-methoxyphenyl)cyclohe...)
Affinity DataKi:  16nM. Assay description: Displacement of [3H](-)-(S)-emopamil from EBP in guinea pig liver membrane
In DepthDetails ArticlePubMed
TargetSigma non-opioid intracellular receptor 1(Cavia porcellus (Guinea pig))
Universita Degli Studi Di Bari
Curated by ChEMBL
LigandPNGBDBM50274835(CHEMBL511857 | trans-1-(4-(3-methoxyphenyl)cyclohe...)
Affinity DataKi:  25nM. Assay description: Displacement of [3H](+)-pentazocine from sigma 1 receptor in guinea pig brain membrane without cerebellum
In DepthDetails ArticlePubMed
Target5-hydroxytryptamine receptor 1A(Homo sapiens (Human))
Karolinska Institute And Karolinska University Hospital
Curated by ChEMBL
LigandPNGBDBM50274835(CHEMBL511857 | trans-1-(4-(3-methoxyphenyl)cyclohe...)
Affinity DataEC50:  0.794nM. Assay description: Agonist activity at human 5-HT1A receptor expressed in CHO cells assessed as inhibition of forskolin-stimulated cAMP accumulation after 15 mins by EL...
In DepthDetails ArticlePubMed
Target5-hydroxytryptamine receptor 1A(Homo sapiens (Human))
Karolinska Institute And Karolinska University Hospital
Curated by ChEMBL
LigandPNGBDBM50274835(CHEMBL511857 | trans-1-(4-(3-methoxyphenyl)cyclohe...)
Affinity DataEC50:  0.324nM. Assay description: Agonist activity at human 5-HT1A receptor expressed in CHO cells after 90 mins by beta-arrestin-2 recruitment assay
In DepthDetails ArticlePubMed