BDBM50274859 (Z)-3-Amino-5-(biphenyl-2'-ylmethylene)-2-thioxothiazolidin-4-one::CHEMBL511164
SMILES NN1C(=S)S\C(=C/c2ccccc2-c2ccccc2)C1=O
InChI Key InChIKey=JQJVMGHZLZXVOS-UVTDQMKNSA-N
Data  1 IC50
  Tab Delimited (TSV)   2D SDfile   Computed 3D by Vconf -m prep SDfile
Find this compound or compounds like it in BindingDB:
Activity Spreadsheet -- Enzyme Inhibition Constant Data from BindingDB
Found 1 hit for monomerid = 50274859
TargetArylamine N-acetyltransferase 2(Mus musculus)
University Of Oxford
Curated by ChEMBL
LigandPNGBDBM50274859((Z)-3-Amino-5-(biphenyl-2'-ylmethylene)-2-thioxoth...)
Affinity DataIC50:  300nM. Assay description: Inhibition of mouse recombinant NAT2 assessed as hydrolysis of acetyl coA using PABA as substrate by Ellman's method
In DepthDetails ArticlePubMed