BDBM50274891 (Z)-5-(Naphthalen-2'-ylmethylene)-2-thioxothiazolidin-4-one::CHEMBL456850
SMILES SC1=NC(=O)C(S1)=Cc1ccc2ccccc2c1
InChI Key InChIKey=ATGWUPYXIYFRKP-UHFFFAOYSA-N
Data  2 IC50
  Tab Delimited (TSV)   2D SDfile   Computed 3D by Vconf -m prep SDfile
Find this compound or compounds like it in BindingDB:
Activity Spreadsheet -- Enzyme Inhibition Constant Data from BindingDB
Found 2 hits for monomerid = 50274891
TargetSerine/threonine-protein kinase pim-1(Homo sapiens (Human))
University Of Oxford
Curated by ChEMBL
LigandPNGBDBM50274891((Z)-5-(Naphthalen-2'-ylmethylene)-2-thioxothiazoli...)
Affinity DataIC50:  113nM. Assay description: Inhibition of recombinant PIM1 (unknown origin) by pyruvate kinase/lactate dehydrogenase-coupled assay
In DepthDetails ArticlePubMed
TargetArylamine N-acetyltransferase 2(Mus musculus)
University Of Oxford
Curated by ChEMBL
LigandPNGBDBM50274891((Z)-5-(Naphthalen-2'-ylmethylene)-2-thioxothiazoli...)
Affinity DataIC50:  2.69E+4nM. Assay description: Inhibition of mouse recombinant NAT2 assessed as hydrolysis of acetyl coA using PABA as substrate by Ellman's method
In DepthDetails ArticlePubMed