BDBM50274970 CHEMBL513936::trans-4-[4-(2,6-Dimethoxyphenyl)cyclohexyl]-1-(2-pyridinyl)piperazine
SMILES COc1cccc(OC)c1[C@H]1CC[C@@H](CC1)N1CCN(CC1)c1ccccn1
InChI Key InChIKey=NYWPLIFCHQRPAI-WGSAOQKQSA-N
Data  2 KI
  Tab Delimited (TSV)   2D SDfile   Computed 3D by Vconf -m prep SDfile
Find this compound or compounds like it in BindingDB:
Activity Spreadsheet -- Enzyme Inhibition Constant Data from BindingDB
Found 2 hits for monomerid = 50274970
Target3-beta-hydroxysteroid-Delta(8),Delta(7)-isomerase(Cavia porcellus)
Universita Degli Studi Di Bari
Curated by ChEMBL
LigandPNGBDBM50274970(CHEMBL513936 | trans-4-[4-(2,6-Dimethoxyphenyl)cyc...)
Affinity DataKi:  7nM. Assay description: Displacement of [3H](-)-(S)-emopamil from EBP in guinea pig liver membrane
In DepthDetails ArticlePubMed
TargetSigma non-opioid intracellular receptor 1(Cavia porcellus (Guinea pig))
Universita Degli Studi Di Bari
Curated by ChEMBL
LigandPNGBDBM50274970(CHEMBL513936 | trans-4-[4-(2,6-Dimethoxyphenyl)cyc...)
Affinity DataKi:  215nM. Assay description: Displacement of [3H](+)-pentazocine from sigma 1 receptor in guinea pig brain membrane without cerebellum
In DepthDetails ArticlePubMed