BDBM50275026 (Z)-5-(2'-Hydroxybenzylidene)-3-methyl-2-thioxothiazolidin-4-one::CHEMBL458956
SMILES CN1C(=S)S\C(=C/c2ccccc2O)C1=O
InChI Key InChIKey=TZKNKVSXJSTKDZ-TWGQIWQCSA-N
Data  1 IC50
  Tab Delimited (TSV)   2D SDfile   Computed 3D by Vconf -m prep SDfile
Find this compound or compounds like it in BindingDB:
Activity Spreadsheet -- Enzyme Inhibition Constant Data from BindingDB
Found 1 hit for monomerid = 50275026
TargetArylamine N-acetyltransferase 2(Mus musculus)
University Of Oxford
Curated by ChEMBL
LigandPNGBDBM50275026((Z)-5-(2'-Hydroxybenzylidene)-3-methyl-2-thioxothi...)
Affinity DataIC50:  2.01E+4nM. Assay description: Inhibition of mouse recombinant NAT2 assessed as hydrolysis of acetyl coA using PABA as substrate by Ellman's method
In DepthDetails ArticlePubMed