BDBM50275028 (Z)-5-(4'-Methoxybenzylidene)-3-methyl-2-thioxothiazolidin-4-one::CHEMBL458955
SMILES COc1ccc(\C=C2/SC(=S)N(C)C2=O)cc1
InChI Key InChIKey=FKFMMSOHYHLUCK-YFHOEESVSA-N
Data  1 IC50
  Tab Delimited (TSV)   2D SDfile   Computed 3D by Vconf -m prep SDfile
Find this compound or compounds like it in BindingDB:
Activity Spreadsheet -- Enzyme Inhibition Constant Data from BindingDB
Found 1 hit for monomerid = 50275028
TargetArylamine N-acetyltransferase 2(Mus musculus)
University Of Oxford
Curated by ChEMBL
LigandPNGBDBM50275028((Z)-5-(4'-Methoxybenzylidene)-3-methyl-2-thioxothi...)
Affinity DataIC50:  1.00E+3nM. Assay description: Inhibition of mouse recombinant NAT2 assessed as hydrolysis of acetyl coA using PABA as substrate by Ellman's method
In DepthDetails ArticlePubMed