BDBM50275220 2-{2-[2-(3-Methoxyphenyl)ethyl]phenoxy}ethyl-4-(N-methyl)piperazine::CHEMBL487960
SMILES COc1cccc(CCc2ccccc2OCCN2CCN(C)CC2)c1
InChI Key InChIKey=QNUFXAULMIMQGB-UHFFFAOYSA-N
Data  2 KI  2 IC50
  Tab Delimited (TSV)   2D SDfile   Computed 3D by Vconf -m prep SDfile
Find this compound or compounds like it in BindingDB:
Activity Spreadsheet -- Enzyme Inhibition Constant Data from BindingDB
Found 4 hits for monomerid = 50275220
TargetD(2) dopamine receptor(Homo sapiens (Human))
Universita Degli Studi Di Bari
Curated by ChEMBL
LigandPNGBDBM50275220(2-{2-[2-(3-Methoxyphenyl)ethyl]phenoxy}ethyl-4-(N-...)
Affinity DataKi:  1.78E+5nM. Assay description: Displacement of [3H]spiroperidol from human cloned dopaminergic D2 receptor expressed in rat C6 cells
In DepthDetails ArticlePubMed
Target5-hydroxytryptamine receptor 1A(Homo sapiens (Human))
Universita Degli Studi Di Bari
Curated by ChEMBL
LigandPNGBDBM50275220(2-{2-[2-(3-Methoxyphenyl)ethyl]phenoxy}ethyl-4-(N-...)
Affinity DataKi: >5.00E+6nM. Assay description: Displacement of [3H]8-OH-DPAT from human cloned 5-HT1A receptor expressed in human HeLa cells
In DepthDetails ArticlePubMed
TargetATP-dependent translocase ABCB1(Homo sapiens (Human))
Universita Degli Studi Di Bari
Curated by ChEMBL
LigandPNGBDBM50275220(2-{2-[2-(3-Methoxyphenyl)ethyl]phenoxy}ethyl-4-(N-...)
Affinity DataIC50:  7.76E+3nM. Assay description: Inhibition of ABCB1 (unknown origin) transfected in MDCK cells assessed as increase in calcein-AM accumulation
In DepthDetails ArticlePubMed
TargetATP-dependent translocase ABCB1(Homo sapiens (Human))
Universita Degli Studi Di Bari
Curated by ChEMBL
LigandPNGBDBM50275220(2-{2-[2-(3-Methoxyphenyl)ethyl]phenoxy}ethyl-4-(N-...)
Affinity DataIC50:  800nM. Assay description: Inhibition of ABCB1-mediated [3H]vinblastine transportation in human Caco2 cells
In DepthDetails ArticlePubMed