BDBM50275734 CHEMBL108801::ethyl 4-ethyl-5-(ethylthiocarbonyl)-6-methyl-2-phenyl-1,4-dihydropyridine-3-carboxylate
SMILES CCOC(=O)C1=C(N=C(C)\C(C1CC)=C(\O)SCC)c1ccccc1
InChI Key InChIKey=IHAGXWSASLOSNA-UHFFFAOYSA-N
Data  1 KI  1 EC50
  Tab Delimited (TSV)   2D SDfile   Computed 3D by Vconf -m prep SDfile
Find this compound or compounds like it in BindingDB:
Activity Spreadsheet -- Enzyme Inhibition Constant Data from BindingDB
Found 2 hits for monomerid = 50275734
TargetAdenosine receptor A3(Homo sapiens (Human))
National Institute Of Diabetes And Digestive And Kidney Diseases
Curated by ChEMBL
LigandPNGBDBM50275734(CHEMBL108801 | ethyl 4-ethyl-5-(ethylthiocarbonyl)...)
Affinity DataKi:  2.01E+3nM. Assay description: Binding affinity to human adenosine A3 receptor
In DepthDetails ArticlePubMed
TargetTransient receptor potential cation channel subfamily V member 1(Homo sapiens (Human))
National Institute Of Diabetes And Digestive And Kidney Diseases
Curated by ChEMBL
LigandPNGBDBM50275734(CHEMBL108801 | ethyl 4-ethyl-5-(ethylthiocarbonyl)...)
Affinity DataEC50:  2.81E+4nM. Assay description: Agonist-enhancing activity in epsilon-epitope tagged TRPV1 receptor expressed in mouse NIH3T3 cells assessed as capsaicin-induced 45Ca2+ influx by mi...
In DepthDetails ArticlePubMed