BDBM50275909 5-chloro-N-(4-phenoxybenzyl)pyrazolo[1,5-a]pyrimidin-7-amine::CHEMBL471193
SMILES Clc1cc(NCc2ccc(Oc3ccccc3)cc2)n2nccc2n1
InChI Key InChIKey=CMASVBJFCFMVDT-UHFFFAOYSA-N
Data  1 IC50
  Tab Delimited (TSV)   2D SDfile   Computed 3D by Vconf -m prep SDfile
Find this compound or compounds like it in BindingDB:
Activity Spreadsheet -- Enzyme Inhibition Constant Data from BindingDB
Found 1 hit for monomerid = 50275909
TargetSmall conductance calcium-activated potassium channel protein 3(Homo sapiens (Human))
Bristol-Myers Squibb
Curated by ChEMBL
LigandPNGBDBM50275909(5-chloro-N-(4-phenoxybenzyl)pyrazolo[1,5-a]pyrimid...)
Affinity DataIC50: >3.00E+4nM. Assay description: Inhibition of Kca2.3 channel (unknown origin) expressed in HEK293 cells by thallium flux assay
In DepthDetails ArticlePubMed