BDBM50277459 3-(2-(3-(1,1,2,2-tetrafluoroethoxy)phenyl )-1-(3,3,3-trifluoro-2-hydroxypropyl)-1,2,3,4-tetrahydroquinolin-5-yl)benzonitrile::3-(2-(3-(1,1,2,2-tetrafluoroethoxy)phenyl)-1-(3,3,3-trifluoro-2-hydroxypropyl)-1,2,3,4-tetrahydroquinolin-5-yl)benzonitrile::CHEMBL475898
SMILES OC(CN1C(CCc2c1cccc2-c1cccc(c1)C#N)c1cccc(OC(F)(F)C(F)F)c1)C(F)(F)F
InChI Key InChIKey=ZHCGXQXIFZHXAG-UHFFFAOYSA-N
Data  1 IC50
  Tab Delimited (TSV)   2D SDfile   Computed 3D by Vconf -m prep SDfile
Find this compound or compounds like it in BindingDB:
Activity Spreadsheet -- Enzyme Inhibition Constant Data from BindingDB
Found 1 hit for monomerid = 50277459
TargetCholesteryl ester transfer protein(Homo sapiens (Human))
Johnson & Johnson Pharmaceutical Research & Development
Curated by ChEMBL
LigandPNGBDBM50277459(3-(2-(3-(1,1,2,2-tetrafluoroethoxy)phenyl )-1-(3,3...)
Affinity DataIC50:  235nM. Assay description: Inhibition of human plasma derived CETP
In DepthDetails ArticlePubMed