BDBM50277959 3-(5-(3-chlorophenyl)-2-(3-(1,1,2,2-te trafluoroethoxy)phenyl)-3,4-dihydroquinolin-1(2H)-yl)-1,1,1-trifluoropropan-2-ol::3-(5-(3-chlorophenyl)-2-(3-(1,1,2,2-tetrafluoroethoxy)phenyl)-3,4-dihydroquinolin-1(2H)-yl)-1,1,1-trifluoropropan-2-ol::CHEMBL482575
SMILES OC(CN1C(CCc2c1cccc2-c1cccc(Cl)c1)c1cccc(OC(F)(F)C(F)F)c1)C(F)(F)F
InChI Key InChIKey=KKOFFBAXJSZKCK-UHFFFAOYSA-N
Data  1 IC50
  Tab Delimited (TSV)   2D SDfile   Computed 3D by Vconf -m prep SDfile
Find this compound or compounds like it in BindingDB:
Activity Spreadsheet -- Enzyme Inhibition Constant Data from BindingDB
Found 1 hit for monomerid = 50277959
TargetCholesteryl ester transfer protein(Homo sapiens (Human))
Johnson & Johnson Pharmaceutical Research & Development
Curated by ChEMBL
LigandPNGBDBM50277959(3-(5-(3-chlorophenyl)-2-(3-(1,1,2,2-te trafluoroet...)
Affinity DataIC50:  64nM. Assay description: Inhibition of human plasma derived CETP
In DepthDetails ArticlePubMed