BDBM50278597 4-benzylidene-1-(3,4-dichlorophenyl)pyrazolidine-3,5-dione::CHEMBL469775
SMILES Clc1ccc(cc1Cl)N1NC(=O)C(=Cc2ccccc2)C1=O
InChI Key InChIKey=PAYSDIVTEWDIFN-UHFFFAOYSA-N
Data  1 IC50
  Tab Delimited (TSV)   2D SDfile   Computed 3D by Vconf -m prep SDfile
Find this compound or compounds like it in BindingDB:
Activity Spreadsheet -- Enzyme Inhibition Constant Data from BindingDB
Found 1 hit for monomerid = 50278597
TargetDual specificity tyrosine-phosphorylation-regulated kinase 1A(Homo sapiens (Human))
Inje University
Curated by ChEMBL
LigandPNGBDBM50278597(4-benzylidene-1-(3,4-dichlorophenyl)pyrazolidine-3...)
Affinity DataIC50: >5.00E+4nM. Assay description: Inhibition of Dyrk1 (unknown origin) autophosphorylation
In DepthDetails ArticlePubMed