BDBM50278601 1-(3,4-dichlorophenyl)-4-(3-methoxybenzylidene)pyrazolidine-3,5-dione::CHEMBL511841
SMILES COc1cccc(C=C2C(=O)NN(C2=O)c2ccc(Cl)c(Cl)c2)c1
InChI Key InChIKey=PARDNATVDZPGTO-UHFFFAOYSA-N
Data  1 IC50
  Tab Delimited (TSV)   2D SDfile   Computed 3D by Vconf -m prep SDfile
Find this compound or compounds like it in BindingDB:
Activity Spreadsheet -- Enzyme Inhibition Constant Data from BindingDB
Found 1 hit for monomerid = 50278601
TargetDual specificity tyrosine-phosphorylation-regulated kinase 1A(Homo sapiens (Human))
Inje University
Curated by ChEMBL
LigandPNGBDBM50278601(1-(3,4-dichlorophenyl)-4-(3-methoxybenzylidene)pyr...)
Affinity DataIC50: >5.00E+4nM. Assay description: Inhibition of Dyrk1 (unknown origin) autophosphorylation
In DepthDetails ArticlePubMed