BDBM50279210 CHEMBL525735::N-[2-(Pyridin-4-yl)ethyl]cytisine
SMILES O=c1cccc2[C@@H]3C[C@@H](CN(CCc4ccncc4)C3)Cn12
InChI Key InChIKey=BZYJNEHXZPMFKX-UHFFFAOYSA-N
Data  2 KI
  Tab Delimited (TSV)   2D SDfile   Computed 3D by Vconf -m prep SDfile
Find this compound or compounds like it in BindingDB:
Activity Spreadsheet -- Enzyme Inhibition Constant Data from BindingDB
Found 2 hits for monomerid = 50279210
TargetNeuronal acetylcholine receptor subunit alpha-4(Rattus norvegicus (Rat))
Università
Curated by ChEMBL
LigandPNGBDBM50279210(CHEMBL525735 | N-[2-(Pyridin-4-yl)ethyl]cytisine)
Affinity DataKi:  7.20nM. Assay description: Displacement of (+/-)-[3H]epibatidine from alpha4beta2 nicotinic acetylcholine receptor in rat brain cortex membrane homogenates
In DepthDetails ArticlePubMed
TargetNeuronal acetylcholine receptor subunit alpha-7(Rattus norvegicus (Rat))
Università
Curated by ChEMBL
LigandPNGBDBM50279210(CHEMBL525735 | N-[2-(Pyridin-4-yl)ethyl]cytisine)
Affinity DataKi:  4.20E+3nM. Assay description: Displacement of [125I]alpha-bungarotoxin from alpha7 nicotinic acetylcholine receptor in rat brain cortex membrane homogenates
In DepthDetails ArticlePubMed