BDBM50279617 CHEMBL4172654
SMILES CCCCc1nc2c(N)nc3cc(ccc3c2n1CCSCC)C(=O)OC
InChI Key InChIKey=LUOSTMIGNYMHBM-UHFFFAOYSA-N
Data  1 EC50
  Tab Delimited (TSV)   2D SDfile   Computed 3D by Vconf -m prep SDfile
Find this compound or compounds like it in BindingDB:
Activity Spreadsheet -- Enzyme Inhibition Constant Data from BindingDB
Found 1 hit for monomerid = 50279617
TargetToll-like receptor 7(Homo sapiens (Human))
University Of Minnesota
Curated by ChEMBL
LigandPNGBDBM50279617(CHEMBL4172654)
Affinity DataEC50:  6.67E+3nM. Assay description: Agonist activity at human TLR7 expressed in HEK cells after 8 to 12 hrs by NFkappaB/SEAP reporter gene assay
In DepthDetails ArticlePubMed