BDBM50279622 CHEMBL4174580
SMILES CCCCc1nc2c(N)nc3cc(ccc3c2n1CCCCC(=O)OC)C(=O)OC
InChI Key InChIKey=CBZOGXUGFFQSNJ-UHFFFAOYSA-N
Data  1 EC50
  Tab Delimited (TSV)   2D SDfile   Computed 3D by Vconf -m prep SDfile
Find this compound or compounds like it in BindingDB:
Activity Spreadsheet -- Enzyme Inhibition Constant Data from BindingDB
Found 1 hit for monomerid = 50279622
TargetToll-like receptor 7(Homo sapiens (Human))
University Of Minnesota
Curated by ChEMBL
LigandPNGBDBM50279622(CHEMBL4174580)
Affinity DataEC50:  1.74E+3nM. Assay description: Agonist activity at human TLR7 expressed in HEK cells after 8 to 12 hrs by NFkappaB/SEAP reporter gene assay
In DepthDetails ArticlePubMed