BDBM50279931 CHEMBL4166278
SMILES COc1ccc(NC(=O)CSC(=S)N\N=C\c2ccccn2)cc1
InChI Key InChIKey=YAMAHKPNBKYYCY-VCHYOVAHSA-N
Data  1 IC50
  Tab Delimited (TSV)   2D SDfile   Computed 3D by Vconf -m prep SDfile
Find this compound or compounds like it in BindingDB:
Activity Spreadsheet -- Enzyme Inhibition Constant Data from BindingDB
Found 1 hit for monomerid = 50279931
TargetCystathionine gamma-lyase(Homo sapiens (Human))
University Of Illinois At Chicago
Curated by ChEMBL
LigandPNGBDBM50279931(CHEMBL4166278)
Affinity DataIC50:  2.00E+3nM. Assay description: Inhibition of cystathionine gamma-lyase (unknown origin) assessed as reduction in cysteine formation from CPM using L-cystathionine pre-incubated for...
Ligand InfoPC cidPC sid
In DepthDetails ArticlePubMed