BDBM50279933 CHEMBL4169868
SMILES CSC(=S)N\N=C\c1ncccc1C
InChI Key InChIKey=LLXJSRJABGRYQR-IZZDOVSWSA-N
Data  1 IC50
  Tab Delimited (TSV)   2D SDfile   Computed 3D by Vconf -m prep SDfile
Find this compound or compounds like it in BindingDB:
Activity Spreadsheet -- Enzyme Inhibition Constant Data from BindingDB
Found 1 hit for monomerid = 50279933
TargetCystathionine gamma-lyase(Homo sapiens (Human))
University Of Illinois At Chicago
Curated by ChEMBL
LigandPNGBDBM50279933(CHEMBL4169868)
Affinity DataIC50:  6.00E+3nM. Assay description: Inhibition of cystathionine gamma-lyase (unknown origin) assessed as reduction in cysteine formation from CPM using L-cystathionine pre-incubated for...
In DepthDetails ArticlePubMed