BDBM50280027 CHEMBL4176749
SMILES Cn1cc(Cl)c(\C=N\NC(=S)SCC(=O)Nc2ccc(cc2)C(C)(C)C)n1
InChI Key InChIKey=VSWRKUNFFVCFQC-AWQFTUOYSA-N
Data  1 IC50
  Tab Delimited (TSV)   2D SDfile   Computed 3D by Vconf -m prep SDfile
Find this compound or compounds like it in BindingDB:
Activity Spreadsheet -- Enzyme Inhibition Constant Data from BindingDB
Found 1 hit for monomerid = 50280027
TargetCystathionine gamma-lyase(Homo sapiens (Human))
University Of Illinois At Chicago
Curated by ChEMBL
LigandPNGBDBM50280027(CHEMBL4176749)
Affinity DataIC50:  6.00E+3nM. Assay description: Inhibition of cystathionine gamma-lyase (unknown origin) assessed as reduction in cysteine formation from CPM using L-cystathionine pre-incubated for...
In DepthDetails ArticlePubMed