BDBM50280261 6-{4-[2-(4-Chloro-benzenesulfonylamino)-ethyl]-pyridin-3-yl}-hexanoic acid::CHEMBL298009
SMILES OC(=O)CCCCCc1cnccc1CCNS(=O)(=O)c1ccc(Cl)cc1
InChI Key InChIKey=DEBSSBFIPXAASA-UHFFFAOYSA-N
Data  1 IC50
  Tab Delimited (TSV)   2D SDfile   Computed 3D by Vconf -m prep SDfile
Find this compound or compounds like it in BindingDB:
Activity Spreadsheet -- Enzyme Inhibition Constant Data from BindingDB
Found 1 hit for monomerid = 50280261
TargetThromboxane-A synthase(Homo sapiens (Human))
TBA
Curated by ChEMBL
LigandPNGBDBM50280261(6-{4-[2-(4-Chloro-benzenesulfonylamino)-ethyl]-pyr...)
Affinity DataIC50:  43nM. Assay description: Inhibitory concentration of the compound against thromboxane synthase enzyme
In DepthDetails Article