BDBM50280328 CHEMBL418269::[4,4-Diethyl-6-oxo-1-[2'-(1H-tetrazol-5-yl)-biphenyl-4-ylmethyl]-piperidin-(2E)-ylidene]-acetic acid methyl ester
SMILES CCC1(CC)CC(=O)N(Cc2ccc(cc2)-c2ccccc2-c2nnn[nH]2)\C(C1)=C\C(=O)OC
InChI Key InChIKey=OZPQPTXOHBZCAB-XSFVSMFZSA-N
Data  1 IC50
  Tab Delimited (TSV)   2D SDfile   Computed 3D by Vconf -m prep SDfile
Find this compound or compounds like it in BindingDB:
Activity Spreadsheet -- Enzyme Inhibition Constant Data from BindingDB
Found 1 hit for monomerid = 50280328
TargetType-1 angiotensin II receptor(Bos taurus)
TBA
Curated by ChEMBL
LigandPNGBDBM50280328(CHEMBL418269 | [4,4-Diethyl-6-oxo-1-[2'-(1H-tetraz...)
Affinity DataIC50:  210nM. Assay description: Ability of the compound to displace [125I]- labelled [Sar1,Ileu8] from angiotensin II receptor of bovine adrenal cortex membranes
In DepthDetails Article