BDBM50281137 (2R,3R,4S,5R)-2-[2-Chloro-6-(4-phenylsulfanyl-piperidin-1-ylamino)-purin-9-yl]-5-hydroxymethyl-tetrahydro-furan-3,4-diol::CHEMBL88439
SMILES OC[C@H]1O[C@H]([C@H](O)[C@@H]1O)n1cnc2c(NN3CCC(CC3)Sc3ccccc3)nc(Cl)nc12
InChI Key InChIKey=LONOTIOGPDFYIZ-WVSUBDOOSA-N
Data  4 KI
  Tab Delimited (TSV)   2D SDfile   Computed 3D by Vconf -m prep SDfile
Find this compound or compounds like it in BindingDB:
Activity Spreadsheet -- Enzyme Inhibition Constant Data from BindingDB
Found 4 hits for monomerid = 50281137
TargetAdenosine receptor A1(Rattus norvegicus (rat))
TBA
Curated by ChEMBL
LigandPNGBDBM50281137((2R,3R,4S,5R)-2-[2-Chloro-6-(4-phenylsulfanyl-pipe...)
Affinity DataKi:  0.900nM. Assay description: Tested for inhibition of adenosine A1 receptor binding to rat brain
In DepthDetails Article
TargetAdenosine receptor A1(Rattus norvegicus (rat))
TBA
Curated by ChEMBL
LigandPNGBDBM50281137((2R,3R,4S,5R)-2-[2-Chloro-6-(4-phenylsulfanyl-pipe...)
Affinity DataKi:  0.900nM. Assay description: Binding affinity at Adenosine A1 receptor in rat brain membranes by [3H](R)-PIA displacement.
In DepthDetails Article
TargetAdenosine receptor A2a(Rattus norvegicus (rat))
TBA
Curated by ChEMBL
LigandPNGBDBM50281137((2R,3R,4S,5R)-2-[2-Chloro-6-(4-phenylsulfanyl-pipe...)
Affinity DataKi:  470nM. Assay description: Displacement of [3H]-CGS- 21680 from Adenosine A2 receptor of rat striatal membranes
In DepthDetails Article
TargetAdenosine receptor A2a/A2b(Rattus norvegicus)
TBA
Curated by ChEMBL
LigandPNGBDBM50281137((2R,3R,4S,5R)-2-[2-Chloro-6-(4-phenylsulfanyl-pipe...)
Affinity DataKi:  470nM. Assay description: Tested for inhibition of adenosine A2 receptor binding to rat brain
In DepthDetails Article