BDBM50281429 2-Dimethylaminomethyl-2-methyl-4-phenyl-furan-3-one; hydrochloride::CHEMBL542148
SMILES CN(C)CC1(C)OC=C(C1=O)c1ccccc1
InChI Key InChIKey=ACTYDYCRMLMETO-UHFFFAOYSA-N
Data  2 KI
  Tab Delimited (TSV)   2D SDfile   Computed 3D by Vconf -m prep SDfile
Find this compound or compounds like it in BindingDB:
Activity Spreadsheet -- Enzyme Inhibition Constant Data from BindingDB
Found 2 hits for monomerid = 50281429
TargetSigma non-opioid intracellular receptor 1(Homo sapiens (Human))
TBA
Curated by ChEMBL
LigandPNGBDBM50281429(2-Dimethylaminomethyl-2-methyl-4-phenyl-furan-3-on...)
Affinity DataKi:  8.11E+3nM. Assay description: Binding affinity for sigma receptor in guinea pig brain membrane using radiolabeled ligand [3H]-(+)-SKF- 10,047 was determined
In DepthDetails Article
TargetD(2) dopamine receptor(Homo sapiens (Human))
TBA
Curated by ChEMBL
LigandPNGBDBM50281429(2-Dimethylaminomethyl-2-methyl-4-phenyl-furan-3-on...)
Affinity DataKi: >1.00E+4nM. Assay description: Binding affinity for dopamine receptor D2 in guinea pig striatal membrane using radiolabeled ligand [3H]-spiperone
In DepthDetails Article