BDBM50281467 CHEMBL2370046::{1-[1-(1-{1-Benzyl-3,3-difluoro-4-[2-(2-methoxyamino-3-methyl-butyrylamino)-3-methyl-butyrylamino]-2,4-dioxo-butylcarbamoyl}-ethylcarbamoyl)-ethylcarbamoyl]-2-hydroxy-ethyl}-carbamic acid tert-butyl ester
SMILES CON[C@@H](C(C)C)C(=O)N[C@@H](C(C)C)C(=O)NC(=O)C(F)(F)C(=O)[C@H](Cc1ccccc1)NC(=O)[C@H](C)NC(=O)[C@H](C)NC(=O)[C@H](CO)NC(=O)OC(C)(C)C
InChI Key InChIKey=GCPMXYSPLBHQHR-IRAXVNTPSA-N
Data  1 KI
  Tab Delimited (TSV)   2D SDfile   Computed 3D by Vconf -m prep SDfile
Find this compound or compounds like it in BindingDB:
Activity Spreadsheet -- Enzyme Inhibition Constant Data from BindingDB
Found 1 hit for monomerid = 50281467
TargetGag-Pol polyprotein [489-587](Human immunodeficiency virus type 1)
TBA
Curated by ChEMBL
LigandPNGBDBM50281467(CHEMBL2370046 | {1-[1-(1-{1-Benzyl-3,3-difluoro-4-...)
Affinity DataKi:  1.60E+5nM. Assay description: Tested for inhibitory activity against the recombinant HIV-1 protease
In DepthDetails Article