BDBM50281894 2-(1-Benzyl-piperidin-4-yl)-propan-1-ol::CHEMBL280488
SMILES CC(CO)C1CCN(Cc2ccccc2)CC1
InChI Key InChIKey=OHKSHQLCHROOSK-UHFFFAOYSA-N
Data  1 IC50
  Tab Delimited (TSV)   2D SDfile   Computed 3D by Vconf -m prep SDfile
Find this compound or compounds like it in BindingDB:
Activity Spreadsheet -- Enzyme Inhibition Constant Data from BindingDB
Found 1 hit for monomerid = 50281894
TargetLanosterol synthase(Rattus norvegicus)
TBA
Curated by ChEMBL
LigandPNGBDBM50281894(2-(1-Benzyl-piperidin-4-yl)-propan-1-ol | CHEMBL28...)
Affinity DataIC50:  5.70E+4nM. Assay description: Inhibitory concentration against purified rat liver Oxidosqualene cyclase (OSC)
In DepthDetails Article