BDBM50281896 1-((E)-1,5,9-Trimethyl-deca-4,8-dienyl)-piperidin-3-ol::CHEMBL17633
SMILES [#6]-[#6](-[#6]-[#6]\[#6]=[#6](/[#6])-[#6]-[#6]\[#6]=[#6](\[#6])-[#6])-[#7]-1-[#6]-[#6]-[#6]-[#6](-[#8])-[#6]-1
InChI Key InChIKey=SSSDYALKOWZXIN-MHWRWJLKSA-N
Data  1 IC50
  Tab Delimited (TSV)   2D SDfile   Computed 3D by Vconf -m prep SDfile
Find this compound or compounds like it in BindingDB:
Activity Spreadsheet -- Enzyme Inhibition Constant Data from BindingDB
Found 1 hit for monomerid = 50281896
TargetLanosterol synthase(Rattus norvegicus)
TBA
Curated by ChEMBL
LigandPNGBDBM50281896(1-((E)-1,5,9-Trimethyl-deca-4,8-dienyl)-piperidin-...)
Affinity DataIC50:  4.00E+4nM. Assay description: Inhibitory concentration against purified rat liver Oxidosqualene cyclase (OSC)
In DepthDetails Article