BDBM50282258 4'-(8-Butyl-6-oxo-7,9-diaza-spiro[4.5]dec-8-en-7-ylmethyl)-biphenyl-2-carboxylic acid::CHEMBL295646
SMILES CCCCC1=NCC2(CCCC2)C(=O)N1Cc1ccc(cc1)-c1ccccc1C(O)=O
InChI Key InChIKey=CRBWYWQPJSJHQB-UHFFFAOYSA-N
Data  1 IC50
  Tab Delimited (TSV)   2D SDfile   Computed 3D by Vconf -m prep SDfile
Find this compound or compounds like it in BindingDB:
Activity Spreadsheet -- Enzyme Inhibition Constant Data from BindingDB
Found 1 hit for monomerid = 50282258
LigandPNGBDBM50282258(4'-(8-Butyl-6-oxo-7,9-diaza-spiro[4.5]dec-8-en-7-y...)
Affinity DataIC50:  71nM. Assay description: In vitro inhibition of specific binding of [125I]-AII to Angiotensin II receptor, type 1 from rat liver membrane
In DepthDetails Article