BDBM50282606 (3S,4S)-5-Cyclohexyl-3-hydroxy-4-((S)-4-methyl-2-{(S)-3-phenyl-2-[3-(1,1,3-trioxo-2,3-dihydro-1H-1lambda*6*-pyrido[4,3-b][1,4]thiazin-4-yl)-propionylamino]-propionylamino}-pentanoylamino)-pentanoic acid (3-imidazol-1-yl-propyl)-amide::CHEMBL284570
SMILES CC(C)C[C@H](NC(=O)[C@H](Cc1ccccc1)NC(=O)CCN1C(=O)CS(=O)(=O)c2ccncc12)C(=O)N[C@@H](CC1CCCCC1)[C@@H](O)CC(=O)NCCCn1ccnc1
InChI Key InChIKey=JAXWKXQCOJCWAH-RRNXAADDSA-N
Data  1 IC50
  Tab Delimited (TSV)   2D SDfile   Computed 3D by Vconf -m prep SDfile
Find this compound or compounds like it in BindingDB:
Activity Spreadsheet -- Enzyme Inhibition Constant Data from BindingDB
Found 1 hit for monomerid = 50282606
TargetRenin(Homo sapiens (Human))
TBA
Curated by ChEMBL
LigandPNGBDBM50282606((3S,4S)-5-Cyclohexyl-3-hydroxy-4-((S)-4-methyl-2-{...)
Affinity DataIC50:  8nM. Assay description: Inhibition of human plasma renin at pH 65.0
In DepthDetails Article