BDBM50283252 (S)-2-[2-((S)-2-{(S)-2-[(S)-2-((S)-2-Amino-4-carbamoyl-butyrylamino)-4-carbamoyl-butyrylamino]-3-phenyl-propionylamino}-3-phenyl-propionylamino)-acetylamino]-4-methyl-pentanoic acid ((S)-1-carbamoyl-3-methylsulfanyl-propyl)-amide::CHEMBL311405
SMILES CSCC[C@H](NC(=O)[C@H](CC(C)C)NC(=O)CNC(=O)[C@H](Cc1ccccc1)NC(=O)[C@H](Cc1ccccc1)NC(=O)[C@H](CCC(N)=O)NC(=O)[C@@H](N)CCC(N)=O)C(N)=O
InChI Key InChIKey=FHHJIELOJQJHCG-JNRWAQIZSA-N
Data  3 IC50
  Tab Delimited (TSV)   2D SDfile   Computed 3D by Vconf -m prep SDfile
Find this compound or compounds like it in BindingDB:
Activity Spreadsheet -- Enzyme Inhibition Constant Data from BindingDB
Found 3 hits for monomerid = 50283252
TargetSubstance-K receptor(HAMSTER)
TBA
Curated by ChEMBL
LigandPNGBDBM50283252((S)-2-[2-((S)-2-{(S)-2-[(S)-2-((S)-2-Amino-4-carba...)
Affinity DataIC50:  3.29E+3nM. Assay description: Concentration producing half-maximal inhibition of specific binding of. [125I]-Neurokinin A to NK-2 receptors in the hamster urinary bladder
In DepthDetails Article
TargetNeuromedin-K receptor(GUINEA PIG)
TBA
Curated by ChEMBL
LigandPNGBDBM50283252((S)-2-[2-((S)-2-{(S)-2-[(S)-2-((S)-2-Amino-4-carba...)
Affinity DataIC50:  1.13E+3nM. Assay description: Concentration producing half-maximal inhibition of specific binding of [3H]-Senktide to Tachykinin receptor 3 in the guinea pig cerebral cortex
In DepthDetails Article
TargetSubstance-P receptor(GUINEA PIG)
TBA
Curated by ChEMBL
LigandPNGBDBM50283252((S)-2-[2-((S)-2-{(S)-2-[(S)-2-((S)-2-Amino-4-carba...)
Affinity DataIC50:  50nM. Assay description: Concentration producing half-maximal inhibition of specific binding of. [125I]-Bolton-Hunter Substance P to NK-1 receptors in the guinea pig cerebral...
In DepthDetails Article