BDBM50283727 (S)-1-[(2S,4R)-2-Hydroxy-4-((1S,2R)-2-hydroxy-indan-1-ylcarbamoyl)-5-pyridin-3-yl-pentyl]-4-thieno[2,3-b]thiophen-2-ylmethyl-piperazine-2-carboxylic acid tert-butylamide::CHEMBL96645
SMILES CC(C)(C)NC(=O)[C@@H]1CN(Cc2cc3ccsc3s2)CCN1C[C@@H](O)C[C@@H](Cc1cccnc1)C(=O)N[C@@H]1[C@H](O)Cc2ccccc12
InChI Key InChIKey=HVWSACNCBBMPIU-HNPDWQJRSA-N
Data  2 IC50
  Tab Delimited (TSV)   2D SDfile   Computed 3D by Vconf -m prep SDfile
Find this compound or compounds like it in BindingDB:
Activity Spreadsheet -- Enzyme Inhibition Constant Data from BindingDB
Found 2 hits for monomerid = 50283727
TargetGag-Pol polyprotein [489-587](Human immunodeficiency virus type 1)
Merck Research Laboratories
Curated by ChEMBL
LigandPNGBDBM50283727((S)-1-[(2S,4R)-2-Hydroxy-4-((1S,2R)-2-hydroxy-inda...)
Affinity DataIC50:  0.120nM. Assay description: Inhibition of HIV-1 protease in vitro.
In DepthDetails ArticlePubMed
TargetGag-Pol polyprotein [489-587](Human immunodeficiency virus type 1)
Merck Research Laboratories
Curated by ChEMBL
LigandPNGBDBM50283727((S)-1-[(2S,4R)-2-Hydroxy-4-((1S,2R)-2-hydroxy-inda...)
Affinity DataIC50:  0.120nM. Assay description: Inhibition of Human Immunodeficiency virus-1 protease
In DepthDetails Article